SAP Knowledge Base Article - Preview

2345016 - Initialization failed with recipe sap_aom_som_b2b_b2c

Symptom

An error appears when running command "install.bat -r sap_aom_som_b2b_b2c initialize" in hybris 6.0, as below:

 

BUILD FAILEDC:\H1\hybris\bin\platform\build.xml:22: The following error occurred while executing this line:
C:\H1\hybris\bin\platform\resources\ant\compiling.xml:88: The following error oc
curred while executing this line:
C:\H1\hybris\bin\platform\resources\ant\compiling.xml:124: The following error o
ccurred while executing this line:
C:\H1\hybris\bin\platform\resources\ant\util.xml:51: The following error occurre
d while executing this line:
C:\H1\hybris\bin\platform\resources\ant\util.xml:53: The following error occurre
d while executing this line:
C:\H1\hybris\bin\platform\resources\ant\compiling.xml:131: The following error o
ccurred while executing this line:
C:\H1\hybris\bin\platform\resources\ant\compiling.xml:284: The following error o
ccurred while executing this line:
C:\H1\hybris\bin\platform\resources\ant\util.xml:146: The following error occurr
ed while executing this line:
C:\H1\hybris\bin\custom\yb2bacceleratorstorefront\buildcallbacks.xml:198: The fo
llowing error occurred while executing this line:
C:\H1\hybris\bin\platform\resources\ant\util.xml:22: The following error occurre
d while executing this line:
C:\H1\hybris\bin\custom\yb2bacceleratorstorefront\buildcallbacks.xml:204: The fo
llowing error occurred while executing this line:
C:\H1\hybris\bin\ext-accelerator\acceleratorservices\resources\acceleratorservic
es\ant\acc-ant-commonweb.xml:13: The following error occurred while executing th
is line:
C:\H1\hybris\bin\platform\resources\ant\util.xml:22: The following error occurre
d while executing this line:
C:\H1\hybris\bin\ext-accelerator\acceleratorservices\resources\acceleratorservic
es\ant\acc-ant-commonweb.xml:15: The following error occurred while executing th
is line:
C:\H1\hybris\bin\platform\resources\ant\util.xml:514: The following error occurr
ed while executing this line:
C:\H1\hybris\bin\ext-accelerator\acceleratorservices\resources\acceleratorservic
es\ant\acc-ant-commonweb.xml:25: The following error occurred while executing th
is line:
C:\H1\hybris\bin\ext-accelerator\acceleratorservices\resources\acceleratorservic
es\ant\acc-ant-commonweb.xml:30: Failed to copy C:\H1\hybris\bin\ext-accelerator
\acceleratorstorefrontcommons\commonweb\src\de\hybris\platform\acceleratorstoref
rontcommons\checkout\steps\CheckoutGroup.java to C:\H1\hybris\bin\custom\yb2bacc
eleratorstorefront\web\commonwebsrc\acceleratorstorefrontcommons\de\hybris\platf
orm\acceleratorstorefrontcommons\checkout\steps\CheckoutGroup.java due to failed
to create the parent directory for C:\H1\hybris\bin\custom\yb2bacceleratorstore
front\web\commonwebsrc\acceleratorstorefrontcommons\de\hybris\platform\accelerat
orstorefrontcommons\checkout\steps\CheckoutGroup.java

Total time: 2 minutes 29 seconds
:recipes/sap_aom_som_b2b_b2c:initialize FAILED

FAILURE: Build failed with an exception.

* Where:
Build file 'C:\H1\installer\recipes\sap_aom_som_b2b_b2c\build.gradle' line: 256

* What went wrong:
Execution failed for task ':recipes/sap_aom_som_b2b_b2c:initialize'.
> external process returned non-zero exit code, command: [cmd, /c, set "ANT_OPTS
=-Xmx1024m" & set "PLATFORM_HOME=C:\H1\hybris\bin\platform" & set "ANT_HOME=C:\H
1\hybris\bin\platform\apache-ant-1.9.1" & set "PATH=C:\H1\hybris\bin\platform\ap
ache-ant-1.9.1\bin;%PATH%" & ant clean all]

* Try:
Run with --stacktrace option to get the stack trace. Run with --info or --debug
option to get more log output.

BUILD FAILED

Total time: 2 mins 35.325 secs
Problem with java process - finished with non-zero exit code (1)

Read more...

Environment

SAP Hybris Commerce 6.0

Product

SAP Hybris Commerce 6.0

Keywords

sap_aom_som_b2b_b2c Initialization failed SAP Hybris Commerce 6.0 , KBA , CEC-COM-CPS-COR , CPS Core (SAP Commerce) , Problem

About this page

This is a preview of a SAP Knowledge Base Article. Click more to access the full version on SAP ONE Support launchpad (Login required).

Search for additional results

Visit SAP Support Portal's SAP Notes and KBA Search.